Target
P2X purinoceptor 6
Ligand
BDBM50336799
Substrate
Meas. Tech.
ChEMBL_147419 (CHEMBL750993)
EC50
>100000±n/a nM
Citation
 Jacobson, KAJarvis, MFWilliams, M Purine and pyrimidine (P2) receptors as drug targets. J Med Chem 45:4057-93 (2002)  
Target
Name:
P2X purinoceptor 6
Synonyms:
ATP receptor P2X6 P2rx6 Purinergic receptor | Purinergic receptor P2X-like 1
Type:
PROTEIN
Mol. Mass.:
42451.11
Organism:
Rattus norvegicus
Description:
ChEMBL_147419
Residue:
379
  
Inhibitor
Name:
BDBM50336799
Synonyms:
5,5',5''-[1,3,6-naphthalenetriyltris(sulfonylimino)]tris[1,3-benzenesulfonate analogue 8,8'-[CARBONYLBIS[IMINO-3,1-PHENYLENECARBONYLIMINO(4-METHYL-3,1-PHENYLENE)CARBONYLIMINO]]BIS-1,3,5-NAPHTHALENETRISULFONIC ACID 8-[(4-methyl-3-{[3-({[3-({2-methyl-5-[(4,6,8-trisulfonaphthalen-1-yl)carbamoyl]phenyl}carbamoyl)phenyl]carbamoyl}amino)benzene]amido}benzene)amido]naphthalene-1,3,5-trisulfonic acid Germanin US8835659, Suramin suramin
Type:
Small organic molecule
Emp. Form.:
C51H40N6O23S6
Mol. Mass.:
1297.28
SMILES:
Cc1ccc(cc1NC(=O)c1cccc(NC(=O)Nc2cccc(c2)C(=O)Nc2cc(ccc2C)C(=O)Nc2ccc(c3cc(cc(c23)S(O)(=O)=O)S(O)(=O)=O)S(O)(=O)=O)c1)C(=O)Nc1ccc(c2cc(cc(c12)S(O)(=O)=O)S(O)(=O)=O)S(O)(=O)=O
: