Target
P2X purinoceptor 5
Ligand
BDBM50118221
Substrate
Meas. Tech.
ChEMBL_147417 (CHEMBL750991)
EC50
>7000±n/a nM
Citation
 Jacobson, KAJarvis, MFWilliams, M Purine and pyrimidine (P2) receptors as drug targets. J Med Chem 45:4057-93 (2002)  
Target
Name:
P2X purinoceptor 5
Synonyms:
ATP receptor P2X5 Purinergic receptor
Type:
PROTEIN
Mol. Mass.:
51486.52
Organism:
Rattus norvegicus
Description:
ChEMBL_147417
Residue:
455
  
Inhibitor
Name:
BDBM50118221
Synonyms:
9H-purine derivative DIPHOSPHOMETHYLPHOSPHONIC ACID ADENOSYL ESTER | alpha,beta-meATP
Type:
Small organic molecule
Emp. Form.:
C11H18N5O12P3
Mol. Mass.:
505.2082
SMILES:
Nc1ncnc2n(cnc12)[C@@H]1O[C@H](COP(O)(=O)CP(O)(=O)OP(O)(O)=O)[C@@H](O)[C@H]1O
: