Target
P2X purinoceptor 1
Ligand
BDBM50118244
Substrate
Meas. Tech.
ChEMBL_149730 (CHEMBL759513)
EC50
14±n/a nM
Citation
 Jacobson, KAJarvis, MFWilliams, M Purine and pyrimidine (P2) receptors as drug targets. J Med Chem 45:4057-93 (2002)  
Target
Name:
P2X purinoceptor 1
Synonyms:
ATP receptor P2X1 Purinergic receptor RP-2 protein
Type:
Enzyme Catalytic Domain
Mol. Mass.:
44969.95
Organism:
RAT
Description:
Purinergic, P2X1 0 RAT::P47824
Residue:
399
  
Inhibitor
Name:
BDBM50118244
Synonyms:
CHEMBL131091 | PPNDS
Type:
Small organic molecule
Emp. Form.:
C18H15N4O14PS2
Mol. Mass.:
606.434
SMILES:
Cc1nc(N=Nc2cc(c3cc(cc(c3c2)S(O)(=O)=O)[N+]([O-])=O)S(O)(=O)=O)c(CO[P+](O)(O)[O-])c(C=O)c1O
: