Target
P2Y purinoceptor 2
Ligand
BDBM50118239
Substrate
Meas. Tech.
ChEMBL_147568 (CHEMBL751765)
EC50
>100000±n/a nM
Citation
 Jacobson, KAJarvis, MFWilliams, M Purine and pyrimidine (P2) receptors as drug targets. J Med Chem 45:4057-93 (2002)  
Target
Name:
P2Y purinoceptor 2
Synonyms:
ATP receptor P2RY2 P2U purinoceptor 1 P2Y purinoceptor 2 Purinergic receptor | Purinergic receptor P2Y2
Type:
PROTEIN
Mol. Mass.:
42299.21
Organism:
Homo sapiens (Human)
Description:
ChEMBL_1455361
Residue:
377
  
Inhibitor
Name:
BDBM50118239
Synonyms:
CHEMBL130266 Uridine diphosphate | uridine 5'-(trihydrogen diphosphate)
Type:
Small organic molecule
Emp. Form.:
C9H14N2O12P2
Mol. Mass.:
404.1612
SMILES:
O[C@@H]1[C@@H](COP(O)(=O)OP(O)(O)=O)O[C@H]([C@@H]1O)n1ccc(=O)[nH]c1=O
: