Target
Thymidine kinase, cytosolic
Ligand
BDBM50118491
Substrate
Meas. Tech.
ChEMBL_208013 (CHEMBL816093)
IC50
3000±n/a nM
Citation
 Hernández, AIBalzarini, JKarlsson, ACamarasa, MJPérez-Pérez, MJ Acyclic nucleoside analogues as novel inhibitors of human mitochondrial thymidine kinase. J Med Chem 45:4254-63 (2002)  
Target
Name:
Thymidine kinase, cytosolic
Synonyms:
KITH_HUMAN | TK1
Type:
PROTEIN
Mol. Mass.:
25476.50
Organism:
Homo sapiens (Human)
Description:
ChEMBL_1333884
Residue:
234
  
Inhibitor
Name:
BDBM50118491
Synonyms:
5-Methyl-1-(4-trityloxy-but-2-enyl)-1H-pyrimidine-2,4-dione | CHEMBL422810
Type:
Small organic molecule
Emp. Form.:
C28H26N2O3
Mol. Mass.:
438.5176
SMILES:
Cc1cn(C\C=C\COC(c2ccccc2)(c2ccccc2)c2ccccc2)c(=O)[nH]c1=O
: