Target
Carbonic anhydrase 2
Ligand
BDBM50108566
Substrate
Meas. Tech.
ChEMBL_45048 (CHEMBL658046)
Ki
844±n/a nM
Citation
 Masereel, BRolin, SAbbate, FScozzafava, ASupuran, CT Carbonic anhydrase inhibitors: anticonvulsant sulfonamides incorporating valproyl and other lipophilic moieties. J Med Chem 45:312-20 (2002)  
Target
Name:
Carbonic anhydrase 2
Synonyms:
CA-II CAC Carbonate dehydratase II Carbonic anhydrase 2 (CA-II) Carbonic anhydrase C Carbonic anhydrase II (CA-II) Carbonic anhydrase II (hCA II) | Carbonic anhydrase isoenzyme II (hCA II)
Type:
Enzyme
Mol. Mass.:
29250.71
Organism:
Homo sapiens (Human)
Description:
P00918
Residue:
260
  
Inhibitor
Name:
BDBM50108566
Synonyms:
2-Propyl-pentanoic acid 2-(4-sulfamoyl-phenyl)-ethyl ester | CHEMBL419006
Type:
Small organic molecule
Emp. Form.:
C16H25NO4S
Mol. Mass.:
327.439
SMILES:
CCCC(CCC)C(=O)OCCc1ccc(cc1)S(N)(=O)=O
: