Target
Carbonic anhydrase 2
Ligand
BDBM50108580
Substrate
Meas. Tech.
ChEMBL_45048 (CHEMBL658046)
Ki
43±n/a nM
Citation
 Masereel, BRolin, SAbbate, FScozzafava, ASupuran, CT Carbonic anhydrase inhibitors: anticonvulsant sulfonamides incorporating valproyl and other lipophilic moieties. J Med Chem 45:312-20 (2002)  
Target
Name:
Carbonic anhydrase 2
Synonyms:
CA-II CAC Carbonate dehydratase II Carbonic anhydrase 2 (CA-II) Carbonic anhydrase C Carbonic anhydrase II (CA-II) Carbonic anhydrase II (hCA II) | Carbonic anhydrase isoenzyme II (hCA II)
Type:
Enzyme
Mol. Mass.:
29250.71
Organism:
Homo sapiens (Human)
Description:
P00918
Residue:
260
  
Inhibitor
Name:
BDBM50108580
Synonyms:
2-Propyl-pentanoic acid (2-iodo-4-sulfamoyl-phenyl)-amide | CHEMBL109142
Type:
Small organic molecule
Emp. Form.:
C14H21IN2O3S
Mol. Mass.:
424.298
SMILES:
CCCC(CCC)C(=O)Nc1ccc(cc1I)S(N)(=O)=O
: