Target
Carbonic anhydrase 1
Ligand
BDBM50108587
Substrate
Meas. Tech.
ChEMBL_47501 (CHEMBL662728)
Ki
1500±n/a nM
Citation
 Masereel, BRolin, SAbbate, FScozzafava, ASupuran, CT Carbonic anhydrase inhibitors: anticonvulsant sulfonamides incorporating valproyl and other lipophilic moieties. J Med Chem 45:312-20 (2002)  
Target
Name:
Carbonic anhydrase 1
Synonyms:
CA-I CAB Carbonate dehydratase I Carbonic anhydrase 1 (CA I) Carbonic anhydrase 1 (Recombinant CA I) Carbonic anhydrase B Carbonic anhydrase I (CA I) Carbonic anhydrase I (CAI) Carbonic anhydrase isoenzyme I (hCA I) | hCA
Type:
Enzyme
Mol. Mass.:
28873.37
Organism:
Homo sapiens (Human)
Description:
P00915
Residue:
261
  
Inhibitor
Name:
BDBM50108587
Synonyms:
2-Propyl-pentanoic acid 4-sulfamoyl-benzyl ester | CHEMBL107722
Type:
Small organic molecule
Emp. Form.:
C15H23NO4S
Mol. Mass.:
313.412
SMILES:
CCCC(CCC)C(=O)OCc1ccc(cc1)S(N)(=O)=O
: