Target
Carbonic anhydrase 2
Ligand
BDBM50108585
Substrate
Meas. Tech.
ChEMBL_45048 (CHEMBL658046)
Ki
1.5±n/a nM
Citation
 Masereel, BRolin, SAbbate, FScozzafava, ASupuran, CT Carbonic anhydrase inhibitors: anticonvulsant sulfonamides incorporating valproyl and other lipophilic moieties. J Med Chem 45:312-20 (2002)  
Target
Name:
Carbonic anhydrase 2
Synonyms:
CA-II CAC Carbonate dehydratase II Carbonic anhydrase 2 (CA-II) Carbonic anhydrase C Carbonic anhydrase II (CA-II) Carbonic anhydrase II (hCA II) | Carbonic anhydrase isoenzyme II (hCA II)
Type:
Enzyme
Mol. Mass.:
29250.71
Organism:
Homo sapiens (Human)
Description:
P00918
Residue:
260
  
Inhibitor
Name:
BDBM50108585
Synonyms:
3-[4-(5-Sulfamoyl-[1,3,4]thiadiazol-2-ylsulfamoyl)-phenylcarbamoyl]-bicyclo[2.2.1]hept-5-ene-2-carboxylic acid | CHEMBL111216
Type:
Small organic molecule
Emp. Form.:
C17H17N5O7S3
Mol. Mass.:
499.541
SMILES:
NS(=O)(=O)c1nnc(NS(=O)(=O)c2ccc(NC(=O)[C@@H]3C4CC(C=C4)C3C(O)=O)cc2)s1
: