Target
Glutamate receptor 4
Ligand
BDBM86751
Substrate
Meas. Tech.
ChEMBL_90300 (CHEMBL874140)
Ki
50000±n/a nM
Citation
 Filla, SAWinter, MAJohnson, KWBleakman, DBell, MGBleisch, TJCastaño, AMClemens-Smith, Adel Prado, MDieckman, DKDominguez, EEscribano, AHo, KHHudziak, KJKatofiasc, MAMartinez-Perez, JAMateo, AMathes, BMMattiuz, ELOgden, AMPhebus, LAStack, DRStratford, REOrnstein, PL Ethyl (3S,4aR,6S,8aR)-6-(4-ethoxycar- bonylimidazol-1-ylmethyl)decahydroiso-quinoline-3-carboxylic ester: a prodrug of a GluR5 kainate receptor antagonist active in two animal models of acute migraine. J Med Chem 45:4383-6 (2002)  
Target
Name:
Glutamate receptor 4
Synonyms:
GLUR4 GRIA4_HUMAN Glutamate receptor ionotropic AMPA | Glutamate receptor ionotropic, AMPA 4
Type:
PROTEIN
Mol. Mass.:
100881.87
Organism:
Homo sapiens (Human)
Description:
ChEMBL_468628
Residue:
902
  
Inhibitor
Name:
BDBM86751
Synonyms:
CHEMBL14935 LY-293558
Type:
Small organic molecule
Emp. Form.:
C13H21N5O2
Mol. Mass.:
279.3381
SMILES:
OC(=O)[C@@H]1C[C@H]2C[C@@H](CCc3nnn[nH]3)CC[C@H]2CN1
: