Target
Prothrombin
Ligand
BDBM50118727
Substrate
Meas. Tech.
ChEMBL_208329 (CHEMBL813561)
Ki
1.1±n/a nM
Citation
 Adang, AEde Man, APVogel, GMGrootenhuis, PDSmit, MJPeters, CAVisser, ARewinkel, JBvan Dinther, TLucas, HKelder, Jvan Aelst, SMeuleman, DGvan Boeckel, CA Unique overlap in the prerequisites for thrombin inhibition and oral bioavailability resulting in potent oral antithrombotics. J Med Chem 45:4419-32 (2002)  
Target
Name:
Prothrombin
Synonyms:
Activation peptide fragment 1 Coagulation factor II Prothrombin precursor Thrombin heavy chain | Thrombin light chain
Type:
Protein
Mol. Mass.:
70029.57
Organism:
Homo sapiens (Human)
Description:
P00734
Residue:
622
  
Inhibitor
Name:
BDBM50118727
Synonyms:
2-((R)-1-((S)-2-(((S)-7-amino-1-isopropoxy-1,2-dioxoheptan-3-yl)carbamoyl)pyrrolidin-1-yl)-3-cyclohexyl-1-oxopropan-2-ylamino)acetic acid CHEMBL139242
Type:
Small organic molecule
Emp. Form.:
C26H44N4O7
Mol. Mass.:
524.6502
SMILES:
CC(C)OC(=O)C(=O)[C@H](CCCCN)NC(=O)[C@@H]1CCCN1C(=O)[C@@H](CC1CCCCC1)NCC(O)=O
: