Target
Melanocortin receptor 5
Ligand
BDBM50121261
Substrate
Meas. Tech.
ChEMBL_106512 (CHEMBL713016)
EC50
0.03±n/a nM
Citation
 Grieco, PLavecchia, ACai, MTrivedi, DWeinberg, DMacNeil, TVan der Ploeg, LHHruby, VJ Structure-activity studies of the melanocortin peptides: discovery of potent and selective affinity antagonists for the hMC3 and hMC4 receptors. J Med Chem 45:5287-94 (2002)  
Target
Name:
Melanocortin receptor 5
Synonyms:
MC-2 MC5R Melanocortin MC5 Melanocortin receptor 5 | Melanocortin receptor 5 (MC5R)
Type:
Enzyme
Mol. Mass.:
36612.92
Organism:
Homo sapiens (Human)
Description:
P33032
Residue:
325
  
Inhibitor
Name:
BDBM50121261
Synonyms:
5-(2-Acetylamino-hexanoylamino)-19-[3-(diaminomethaniminium)-propyl]-24-hydroxy-16-(1H-indol-3-ylmethyl)-22-naphthalen-2-ylmethyl-4,7,15,18,21-pentaoxo-tetracosahydro-3a,8,14,17,20,23-hexaaza-cyclopentacyclotricosene-13-carboxylic acid amide PG-911
Type:
Small organic molecule
Emp. Form.:
C53H74N13O9
Mol. Mass.:
1037.2358
SMILES:
CCCC[C@@H](NC(C)=O)C(=O)N[C@@H]1CC(=O)NCCCC[C@H](NC(=O)[C@H](Cc2c[nH]c3ccccc23)NC(=O)[C@@H](CCCNC(N)=[NH2+])NC(=O)[C@H](Cc2ccc3ccccc3c2)NC(O)[C@H]2CCCN2C1=O)C(N)=O
: