Target
P2Y purinoceptor 1
Ligand
BDBM50267999
Substrate
Meas. Tech.
ChEMBL_147710 (CHEMBL759180)
EC50
2.6±n/a nM
Citation
 Nahum, VZündorf, GLévesque, SABeaudoin, ARReiser, GFischer, B Adenosine 5'-O-(1-boranotriphosphate) derivatives as novel P2Y(1) receptor agonists. J Med Chem 45:5384-96 (2002)  
Target
Name:
P2Y purinoceptor 1
Synonyms:
ATP receptor P2Y1 Purinergic receptor | Purinergic receptor P2Y1
Type:
PROTEIN
Mol. Mass.:
42338.46
Organism:
Rattus norvegicus
Description:
ChEMBL_873671
Residue:
373
  
Inhibitor
Name:
BDBM50267999
Synonyms:
({[({[(2R,3S,4R,5R)-5-[6-amino-2-(methylsulfanyl)-9H-purin-9-yl]-3,4-dihydroxyoxolan-2-yl]methoxy}(boranuidyl)phosphoryl)oxy]phosphinato}oxy)phosphonate | CHEMBL601711
Type:
Small organic molecule
Emp. Form.:
C11H17BN5O12P3S
Mol. Mass.:
547.078
SMILES:
[BH3-]P(=O)(OC[C@H]1O[C@H]([C@H](O)[C@@H]1O)n1cnc2c(N)nc(SC)nc12)OP([O-])(=O)OP([O-])([O-])=O
: