Target
D(2) dopamine receptor
Ligand
BDBM50068374
Substrate
Meas. Tech.
ChEMBL_60208 (CHEMBL672170)
Ki
2990±n/a nM
Citation
 Leopoldo, MBerardi, FColabufo, NADe Giorgio, PLacivita, EPerrone, RTortorella, V Structure-affinity relationship study on N-[4-(4-arylpiperazin-1-yl)butyl]arylcarboxamides as potent and selective dopamine D(3) receptor ligands. J Med Chem 45:5727-35 (2002)  
Target
Name:
D(2) dopamine receptor
Synonyms:
D(2) dopamine receptor DOPAMINE D2 Long DRD2 Dopamine D2 receptor Dopamine D2 receptor (D2R) Dopamine2-like | d2
Type:
Cell-surface receptors
Mol. Mass.:
50647.10
Organism:
Homo sapiens (Human)
Description:
P14416
Residue:
443
  
Inhibitor
Name:
BDBM50068374
Synonyms:
3-Methoxy-N-{3-[4-(2-methoxy-phenyl)-piperazin-1-yl]-propyl}-benzamide | CHEMBL357448
Type:
Small organic molecule
Emp. Form.:
C22H29N3O3
Mol. Mass.:
383.484
SMILES:
COc1cccc(c1)C(=O)NCCCN1CCN(CC1)c1ccccc1OC
: