Target
17-beta-hydroxysteroid dehydrogenase type 3
Ligand
BDBM91713
Substrate
Meas. Tech.
ChEMBL_213259 (CHEMBL818799)
IC50
758±n/a nM
Citation
 Maltais, RLuu-The, VPoirier, D Synthesis and optimization of a new family of type 3 17 beta-hydroxysteroid dehydrogenase inhibitors by parallel liquid-phase chemistry. J Med Chem 45:640-53 (2002)  
Target
Name:
17-beta-hydroxysteroid dehydrogenase type 3
Synonyms:
17-beta-hydroxysteroid dehydrogenase type 3 EDH17B3 HSD17B3 | SDR12C2
Type:
Enzyme
Mol. Mass.:
34525.39
Organism:
Homo sapiens (Human)
Description:
P37058
Residue:
310
  
Inhibitor
Name:
BDBM91713
Synonyms:
Androst-4-en-3,17-dione, 2 Androstenedione
Type:
Small organic molecule
Emp. Form.:
C19H26O2
Mol. Mass.:
286.4085
SMILES:
C[C@]12CC[C@H]3[C@@H](CCC4=CC(=O)CC[C@]34C)[C@@H]1CCC2=O
: