Target
Inosine-5'-monophosphate dehydrogenase 2
Ligand
BDBM50367389
Substrate
Meas. Tech.
ChEMBL_89939 (CHEMBL699565)
Ki
110±n/a nM
Citation
 Pankiewicz, KWLesiak-Watanabe, KBWatanabe, KAPatterson, SEJayaram, HNYalowitz, JAMiller, MDSeidman, MMajumdar, APrehna, GGoldstein, BM Novel mycophenolic adenine bis(phosphonate) analogues as potential differentiation agents against human leukemia. J Med Chem 45:703-12 (2002)  
Target
Name:
Inosine-5'-monophosphate dehydrogenase 2
Synonyms:
IMDH2_HUMAN IMPD 2 IMPDH-II Inosine 5'-monophosphate dehydrogenase II (IMPDH II) Inosine-5 -monophosphate dehydrogenase 2 | Inosine-5'-monophosphate dehydrogenase (IMPDH)
Type:
Enzyme
Mol. Mass.:
55806.87
Organism:
Homo sapiens (Human)
Description:
Recombinant IMPDH2 expressed in E. coli.
Residue:
514
  
Inhibitor
Name:
BDBM50367389
Synonyms:
CHEMBL605602
Type:
Small organic molecule
Emp. Form.:
C20H27N7O13P2S
Mol. Mass.:
667.48
SMILES:
NC(=O)c1csc(n1)C1O[C@H](COP(O)(=O)CP(O)(=O)OC[C@@H]2OC([C@@H](O)[C@H]2O)n2cnc3c(N)ncnc23)[C@@H](O)[C@H]1O
: