Target
Matrix metalloproteinase-9
Ligand
BDBM50109625
Substrate
Meas. Tech.
ChEMBL_105387 (CHEMBL710806)
Ki
0.6±n/a nM
Citation
 Sawa, MKiyoi, TKurokawa, KKumihara, HYamamoto, MMiyasaka, TIto, YHirayama, RInoue, TKirii, YNishiwaki, EOhmoto, HMaeda, YIshibushi, EInoue, YYoshino, KKondo, H New type of metalloproteinase inhibitor: design and synthesis of new phosphonamide-based hydroxamic acids. J Med Chem 45:919-29 (2002)  
Target
Name:
Matrix metalloproteinase-9
Synonyms:
67 kDa matrix metalloproteinase-9 92 kDa gelatinase CLG4B Gelatinase B MMP9 Matrix metalloproteinase 9 (MMP-9) Matrix metalloproteinase-9 (MMP9)
Type:
Enzyme
Mol. Mass.:
78452.28
Organism:
Homo sapiens (Human)
Description:
P14780
Residue:
707
  
Inhibitor
Name:
BDBM50109625
Synonyms:
(3-Hydroxycarbamoyl-3,4-dihydro-1H-isoquinolin-2-yl)-[4-(pyridin-4-yloxy)-phenyl]-phosphinic acid ethyl ester | CHEMBL173686
Type:
Small organic molecule
Emp. Form.:
C23H24N3O5P
Mol. Mass.:
453.4275
SMILES:
CCOP(=O)(N1Cc2ccccc2CC1C(=O)NO)c1ccc(Oc2ccncc2)cc1
: