Target
Disintegrin and metalloproteinase domain-containing protein 9
Ligand
BDBM50109620
Substrate
Meas. Tech.
ChEMBL_63593 (CHEMBL675240)
IC50
2240±n/a nM
Citation
 Sawa, MKiyoi, TKurokawa, KKumihara, HYamamoto, MMiyasaka, TIto, YHirayama, RInoue, TKirii, YNishiwaki, EOhmoto, HMaeda, YIshibushi, EInoue, YYoshino, KKondo, H New type of metalloproteinase inhibitor: design and synthesis of new phosphonamide-based hydroxamic acids. J Med Chem 45:919-29 (2002)  
Target
Name:
Disintegrin and metalloproteinase domain-containing protein 9
Synonyms:
ADAM9 Disintegrin and metalloproteinase domain-containing protein 9 (ADAM9) MCMP MLTNG
Type:
Enzyme
Mol. Mass.:
90567.68
Organism:
Homo sapiens (Human)
Description:
Q13443
Residue:
819
  
Inhibitor
Name:
BDBM50109620
Synonyms:
(3-Hydroxycarbamoyl-3,4-dihydro-1H-isoquinolin-2-yl)-(4-methoxy-phenyl)-phosphinic acid isopropyl ester | CHEMBL173744
Type:
Small organic molecule
Emp. Form.:
C20H25N2O5P
Mol. Mass.:
404.3967
SMILES:
COc1ccc(cc1)P(=O)(OC(C)C)N1Cc2ccccc2CC1C(=O)NO
: