Target
Carbonic anhydrase 4
Ligand
BDBM50097293
Substrate
Meas. Tech.
ChEMBL_45265 (CHEMBL658217)
Ki
5±n/a nM
Citation
 Scozzafava, AMenabuoni, LMincione, FSupuran, CT Carbonic anhydrase inhibitors. A general approach for the preparation of water-soluble sulfonamides incorporating polyamino-polycarboxylate tails and of their metal complexes possessing long-lasting, topical intraocular pressure-lowering properties. J Med Chem 45:1466-76 (2002)  
Target
Name:
Carbonic anhydrase 4
Synonyms:
CA-IV CAH4_BOVIN Carbonic Anhydrase IV Carbonic anhydrase 4
Type:
Enzyme
Mol. Mass.:
35152.74
Organism:
Bos taurus (bovine)
Description:
Bovine isozyme, isolated from lung microsomes
Residue:
312
  
Inhibitor
Name:
BDBM50097293
Synonyms:
CHEMBL34852 | {(2-{[2-(Bis-carboxymethyl-amino)-ethyl]-carboxymethyl-amino}-ethyl)-[2-(2-sulfamoyl-benzothiazol-6-yloxy)-ethoxycarbonylmethyl]-amino}-acetic acid
Type:
Small organic molecule
Emp. Form.:
C23H31N5O13S2
Mol. Mass.:
649.648
SMILES:
NS(=O)(=O)c1nc2ccc(OCCOC(=O)CN(CCN(CCN(CC(O)=O)CC(O)=O)CC(O)=O)CC(O)=O)cc2s1
: