Target
Carbonic anhydrase 4
Ligand
BDBM50097307
Substrate
Meas. Tech.
ChEMBL_45265 (CHEMBL658217)
Ki
4±n/a nM
Citation
 Scozzafava, AMenabuoni, LMincione, FSupuran, CT Carbonic anhydrase inhibitors. A general approach for the preparation of water-soluble sulfonamides incorporating polyamino-polycarboxylate tails and of their metal complexes possessing long-lasting, topical intraocular pressure-lowering properties. J Med Chem 45:1466-76 (2002)  
Target
Name:
Carbonic anhydrase 4
Synonyms:
CA-IV CAH4_BOVIN Carbonic Anhydrase IV Carbonic anhydrase 4
Type:
Enzyme
Mol. Mass.:
35152.74
Organism:
Bos taurus (bovine)
Description:
Bovine isozyme, isolated from lung microsomes
Residue:
312
  
Inhibitor
Name:
BDBM50097307
Synonyms:
CHEMBL408856 | [[2-(Carboxymethyl-{2-[carboxymethyl-(2-sulfamoyl-benzothiazol-6-yloxycarbonylmethyl)-amino]-ethyl}-amino)-ethyl]-(2-sulfamoyl-benzothiazol-6-yloxycarbonylmethyl)-amino]-acetic acid
Type:
Small organic molecule
Emp. Form.:
C28H31N7O14S4
Mol. Mass.:
817.844
SMILES:
NS(=O)(=O)c1nc2ccc(OC(=O)CN(CCN(CCN(CC(O)=O)CC(=O)Oc3ccc4nc(sc4c3)S(N)(=O)=O)CC(O)=O)CC(O)=O)cc2s1
: