Target
Carbonic anhydrase 4
Ligand
BDBM10874
Substrate
Meas. Tech.
ChEMBL_45265 (CHEMBL658217)
Ki
17±n/a nM
Citation
 Scozzafava, AMenabuoni, LMincione, FSupuran, CT Carbonic anhydrase inhibitors. A general approach for the preparation of water-soluble sulfonamides incorporating polyamino-polycarboxylate tails and of their metal complexes possessing long-lasting, topical intraocular pressure-lowering properties. J Med Chem 45:1466-76 (2002)  
Target
Name:
Carbonic anhydrase 4
Synonyms:
CA-IV CAH4_BOVIN Carbonic Anhydrase IV Carbonic anhydrase 4
Type:
Enzyme
Mol. Mass.:
35152.74
Organism:
Bos taurus (bovine)
Description:
Bovine isozyme, isolated from lung microsomes
Residue:
312
  
Inhibitor
Name:
BDBM10874
Synonyms:
6-hydroxy-1,3-benzothiazole-2-sulfonamide aromatic/heteroaromatic sulfonamide 19
Type:
Small organic molecule
Emp. Form.:
C7H6N2O3S2
Mol. Mass.:
230.264
SMILES:
NS(=O)(=O)c1nc2ccc(O)cc2s1
: