Target
Beta-galactosidase
Ligand
BDBM50111585
Substrate
Meas. Tech.
ChEMBL_37409 (CHEMBL651841)
IC50
90000±n/a nM
Citation
 McGovern, SLCaselli, EGrigorieff, NShoichet, BK A common mechanism underlying promiscuous inhibitors from virtual and high-throughput screening. J Med Chem 45:1712-22 (2002)  
Target
Name:
Beta-galactosidase
Synonyms:
Acid beta-galactosidase ELNR1 GLB1 | Lactase
Type:
PROTEIN
Mol. Mass.:
76074.43
Organism:
Homo sapiens (Human)
Description:
ChEMBL_215886
Residue:
677
  
Inhibitor
Name:
BDBM50111585
Synonyms:
4-(4-Bromo-phenylazo)-phenol CHEMBL34712
Type:
Small organic molecule
Emp. Form.:
C12H9BrN2O
Mol. Mass.:
277.117
SMILES:
Oc1ccc(cc1)N=Nc1ccc(Br)cc1
: