Target
Dihydrofolate reductase
Ligand
BDBM50369776
Substrate
Meas. Tech.
ChEMBL_53613 (CHEMBL661843)
IC50
25000±n/a nM
Citation
 McGovern, SLCaselli, EGrigorieff, NShoichet, BK A common mechanism underlying promiscuous inhibitors from virtual and high-throughput screening. J Med Chem 45:1712-22 (2002)  
Target
Name:
Dihydrofolate reductase
Synonyms:
1.5.1.3 DYR_CHICK
Type:
Mol. Mass.:
21652.69
Organism:
Gallus gallus (Chicken)
Description:
Residue:
189
  
Inhibitor
Name:
BDBM50369776
Synonyms:
CHEMBL298301
Type:
Small organic molecule
Emp. Form.:
C15H6Cl6N4O6
Mol. Mass.:
550.949
SMILES:
[O-][N+](=O)c1ccc(NN2C(=O)C3C(C2=O)[C@@]2(Cl)C(Cl)=C(Cl)[C@]3(Cl)C2(Cl)Cl)c(c1)[N+]([O-])=O
: