Target
Acetylcholinesterase
Ligand
BDBM10518
Substrate
Meas. Tech.
ChEMBL_27955 (CHEMBL649135)
Ki
150±n/a nM
Citation
 Savini, LGaeta, AFattorusso, CCatalanotti, BCampiani, GChiasserini, LPellerano, CNovellino, EMcKissic, DSaxena, A Specific targeting of acetylcholinesterase and butyrylcholinesterase recognition sites. Rational design of novel, selective, and highly potent cholinesterase inhibitors. J Med Chem 46:1-4 (2002)  
Target
Name:
Acetylcholinesterase
Synonyms:
ACES_BOVIN Acetylcholinesterase (AChE) | Acetylcholinesterase precursor
Type:
Enzyme
Mol. Mass.:
67659.62
Organism:
Bos taurus (bovine)
Description:
Residue:
613
  
Inhibitor
Name:
BDBM10518
Synonyms:
6,8-dichloro-N-{7-[(6,8-dichloro-1,2,3,4-tetrahydroacridin-9-yl)amino]heptyl}-1,2,3,4-tetrahydroacridin-9-amine tacrine homobivalent compound 3b
Type:
Small organic molecule
Emp. Form.:
C33H36Cl4N4
Mol. Mass.:
630.478
SMILES:
Clc1cc(Cl)c2c(NCCCCCCCNc3c4CCCCc4nc4cc(Cl)cc(Cl)c34)c3CCCCc3nc2c1
: