Target
Beta-3 adrenergic receptor
Ligand
BDBM50122651
Substrate
Meas. Tech.
ChEMBL_38644 (CHEMBL652588)
EC50
490±n/a nM
Citation
 Tanaka, NTamai, TMukaiyama, HHirabayashi, AMuranaka, HIshikawa, TKobayashi, JAkahane, SAkahane, M Relationship between stereochemistry and the beta3-adrenoceptor agonistic activity of 4'-hydroxynorephedrine derivative as an agent for treatment of frequent urination and urinary incontinence. J Med Chem 46:105-12 (2002)  
Target
Name:
Beta-3 adrenergic receptor
Synonyms:
ADRB3 ADRB3_HUMAN Beta-2 adrenergic receptor and beta-3 adrenergic receptor Beta-3 adrenoreceptor | adrenergic Beta3
Type:
G Protein-Coupled Receptor (GPCR)
Mol. Mass.:
43534.88
Organism:
Homo sapiens (Human)
Description:
Residue:
408
  
Inhibitor
Name:
BDBM50122651
Synonyms:
(alpha R,betaS) (2-Chloro-4-{2-[2-hydroxy-2-(4-hydroxy-phenyl)-1-methyl-ethylamino]-ethyl}-phenoxy)-acetic acid | CHEMBL14059
Type:
Small organic molecule
Emp. Form.:
C19H22ClNO5
Mol. Mass.:
379.835
SMILES:
CC(NCCc1ccc(OCC(O)=O)c(Cl)c1)[C@H](O)c1ccc(O)cc1
: