Target
Endothelin-1 receptor
Ligand
BDBM50122676
Substrate
Meas. Tech.
ChEMBL_65652 (CHEMBL678072)
Ki
0.01±n/a nM
Citation
 Murugesan, NGu, ZSpergel, SYoung, MChen, PMathur, ALeith, LHermsmeier, MLiu, ECZhang, RBird, EWaldron, TMarino, AKoplowitz, BHumphreys, WGChong, SMorrison, RAWebb, MLMoreland, STrippodo, NBarrish, JC Biphenylsulfonamide endothelin receptor antagonists. 4. Discovery of N-[[2'-[[(4,5-dimethyl-3-isoxazolyl)amino]sulfonyl]-4-(2-oxazolyl)[1,1'-biphenyl]- 2-yl]methyl]-N,3,3-trimethylbutanamide (BMS-207940), a highly potent and orally active ET(A) selective antagonist. J Med Chem 46:125-37 (2002)  
Target
Name:
Endothelin-1 receptor
Synonyms:
EDNRA ET-A ETA-R Endothelin receptor type A hET-AR
Type:
Enzyme Catalytic Domain
Mol. Mass.:
48736.88
Organism:
Homo sapiens (Human)
Description:
P25101
Residue:
427
  
Inhibitor
Name:
BDBM50122676
Synonyms:
CHEMBL274489 | N-[2'-(4,5-Dimethyl-isoxazol-3-ylsulfamoyl)-4-oxazol-2-yl-biphenyl-2-yl]-3,3,N-trimethyl-butyramide
Type:
Small organic molecule
Emp. Form.:
C27H30N4O5S
Mol. Mass.:
522.616
SMILES:
CN(C(=O)CC(C)(C)C)c1cc(ccc1-c1ccccc1S(=O)(=O)Nc1noc(C)c1C)-c1ncco1
: