Target
Endothelin-1 receptor
Ligand
BDBM50122704
Substrate
Meas. Tech.
ChEMBL_65652 (CHEMBL678072)
Ki
0.15±n/a nM
Citation
 Murugesan, NGu, ZSpergel, SYoung, MChen, PMathur, ALeith, LHermsmeier, MLiu, ECZhang, RBird, EWaldron, TMarino, AKoplowitz, BHumphreys, WGChong, SMorrison, RAWebb, MLMoreland, STrippodo, NBarrish, JC Biphenylsulfonamide endothelin receptor antagonists. 4. Discovery of N-[[2'-[[(4,5-dimethyl-3-isoxazolyl)amino]sulfonyl]-4-(2-oxazolyl)[1,1'-biphenyl]- 2-yl]methyl]-N,3,3-trimethylbutanamide (BMS-207940), a highly potent and orally active ET(A) selective antagonist. J Med Chem 46:125-37 (2002)  
Target
Name:
Endothelin-1 receptor
Synonyms:
EDNRA ET-A ETA-R Endothelin receptor type A hET-AR
Type:
Enzyme Catalytic Domain
Mol. Mass.:
48736.88
Organism:
Homo sapiens (Human)
Description:
P25101
Residue:
427
  
Inhibitor
Name:
BDBM50122704
Synonyms:
2'-{[Methyl-(2,2,2-trifluoro-ethyl)-amino]-methyl}-4'-oxazol-2-yl-biphenyl-2-sulfonic acid (3,4-dimethyl-isoxazol-5-yl)-amide | CHEMBL431296
Type:
Small organic molecule
Emp. Form.:
C24H23F3N4O4S
Mol. Mass.:
520.524
SMILES:
CN(Cc1cc(ccc1-c1ccccc1S(=O)(=O)Nc1onc(C)c1C)-c1ncco1)CC(F)(F)F
: