Target
D(2) dopamine receptor
Ligand
BDBM50058225
Substrate
Meas. Tech.
ChEMBL_59633 (CHEMBL672423)
Ki
25±n/a nM
Citation
 Macchia, MCervetto, LDemontis, GCLongoni, BMinutolo, FOrlandini, EOrtore, GPapi, CSbrana, AMacchia, B New N-n-propyl-substituted 3-aryl- and 3-cyclohexylpiperidines as partial agonists at the D4 dopamine receptor. J Med Chem 46:161-8 (2002)  
Target
Name:
D(2) dopamine receptor
Synonyms:
DOPAMINE D2 DRD2_BOVIN | Dopamine D2 receptor
Type:
Enzyme Catalytic Domain
Mol. Mass.:
50698.79
Organism:
BOVINE
Description:
P20288
Residue:
444
  
Inhibitor
Name:
BDBM50058225
Synonyms:
CHEMBL45244 N-[4-(2-Cyano-phenyl)-piperazin-1-ylmethyl]-3-methyl-benzamide | PD-168077
Type:
Small organic molecule
Emp. Form.:
C20H22N4O
Mol. Mass.:
334.4149
SMILES:
Cc1cccc(c1)C(=O)NCN1CCN(CC1)c1ccccc1C#N
: