Target
Sodium-dependent dopamine transporter
Ligand
BDBM50035734
Substrate
Meas. Tech.
ChEMBL_62013 (CHEMBL671634)
IC50
0.370000±n/a nM
Citation
 Carroll, FI 2002 Medicinal Chemistry Division Award address: monoamine transporters and opioid receptors. Targets for addiction therapy. J Med Chem 46:1775-94 (2003)  
Target
Name:
Sodium-dependent dopamine transporter
Synonyms:
DA transporter SC6A3_RAT Sodium-dependent dopamine transporter | Sodium-dependent dopamine transporter (DAT)
Type:
Multi-pass membrane protein
Mol. Mass.:
68749.45
Organism:
Rattus norvegicus (rat)
Description:
P23977
Residue:
619
  
Inhibitor
Name:
BDBM50035734
Synonyms:
CHEMBL1643896 [3-(4-Iodo-phenyl)-8-methyl-8-aza-bicyclo[3.2.1]oct-2-yl]-pyrrolidin-1-yl-methanone
Type:
Small organic molecule
Emp. Form.:
C19H25IN2O
Mol. Mass.:
424.3191
SMILES:
[H][C@]12CC[C@]([H])([C@H]([C@H](C1)c1ccc(I)cc1)C(=O)N1CCCC1)N2C
: