Target
Sigma non-opioid intracellular receptor 1
Ligand
BDBM50128102
Substrate
Meas. Tech.
ChEMBL_201912 (CHEMBL808202)
Ki
12.6±n/a nM
Citation
 Berardi, FLoiodice, FFracchiolla, GColabufo, NAPerrone, RTortorella, V Synthesis of chiral 1-[omega-(4-chlorophenoxy)alkyl]-4-methylpiperidines and their biological evaluation at sigma1, sigma2, and sterol delta8-delta7 isomerase sites. J Med Chem 46:2117-24 (2003)  
Target
Name:
Sigma non-opioid intracellular receptor 1
Synonyms:
Aging-associated gene 8 protein SGMR1_HUMAN SIGMAR1 SR31747-binding protein Sigma 1-type opioid receptor Sigma1R | hSigmaR1
Type:
Enzyme Catalytic Domain
Mol. Mass.:
25124.85
Organism:
Homo sapiens (Human)
Description:
Q99720
Residue:
223
  
Inhibitor
Name:
BDBM50128102
Synonyms:
1-[2-(4-Chloro-phenoxy)-propyl]-4-methyl-piperidine; hydrochloride | CHEMBL545451
Type:
Small organic molecule
Emp. Form.:
C15H22ClNO
Mol. Mass.:
267.794
SMILES:
C[C@@H](CN1CCC(C)CC1)Oc1ccc(Cl)cc1
: