Target
Steroid 17-alpha-hydroxylase/17,20 lyase
Ligand
BDBM50128560
Substrate
Meas. Tech.
ChEMBL_50527 (CHEMBL661144)
IC50
660.250±n/a nM
Citation
 Clement, OOFreeman, CMHartmann, RWHandratta, VDVasaitis, TSBrodie, AMNjar, VC Three dimensional pharmacophore modeling of human CYP17 inhibitors. Potential agents for prostate cancer therapy. J Med Chem 46:2345-51 (2003)  
Target
Name:
Steroid 17-alpha-hydroxylase/17,20 lyase
Synonyms:
CP17A_HUMAN CYP17A1 Cytochrome P450 17A1 Cytochrome P450 C17 (CYP17) Cytochrome P450-C17 P450-C17 Steroid 17-alpha-Monooxygenase (CYP17) Steroid 17-alpha-monooxygenase | cytochrome P450 monooxygenase 17 alpha hydroxylase/17,20-lyase (CYP17)
Type:
Enzyme
Mol. Mass.:
57382.42
Organism:
Homo sapiens (Human)
Description:
E.coli expressing human CYP17
Residue:
508
  
Inhibitor
Name:
BDBM50128560
Synonyms:
Acetic acid (10R,13S,17S)-10,13-dimethyl-3-oxo-8,9,10,11,12,13,14,15,16,17-decahydro-3H-cyclopenta[a]phenanthren-17-yl ester | CHEMBL419831
Type:
Small organic molecule
Emp. Form.:
C21H26O3
Mol. Mass.:
326.4293
SMILES:
CC(=O)O[C@H]1CCC2C3C=CC4=CC(=O)C=C[C@]4(C)C3CC[C@]12C
: