Target
Interstitial collagenase
Ligand
BDBM50128649
Substrate
Meas. Tech.
ChEMBL_106291 (CHEMBL714547)
IC50
490±n/a nM
Citation
 Aranapakam, VDavis, JMGrosu, GTBaker, JEllingboe, JZask, ALevin, JISandanayaka, VPDu, MSkotnicki, JSDiJoseph, JFSung, ASharr, MAKillar, LMWalter, TJin, GCowling, RTillett, JZhao, WMcDevitt, JXu, ZB Synthesis and structure-activity relationship of N-substituted 4-arylsulfonylpiperidine-4-hydroxamic acids as novel, orally active matrix metalloproteinase inhibitors for the treatment of osteoarthritis. J Med Chem 46:2376-96 (2003)  
Target
Name:
Interstitial collagenase
Synonyms:
CLG MMP1 Matrix metalloproteinase-1 | Matrix metalloproteinase-1 (MMP-1)
Type:
Enzyme
Mol. Mass.:
54010.26
Organism:
Homo sapiens (Human)
Description:
P03956
Residue:
469
  
Inhibitor
Name:
BDBM50128649
Synonyms:
1-(4-methoxybenzyl)-4-(4-(4-chlorophenoxy)phenylsulfonyl)-N-hydroxypiperidine-4-carboxamide CHEMBL78909
Type:
Small organic molecule
Emp. Form.:
C26H27ClN2O6S
Mol. Mass.:
531.02
SMILES:
COc1ccc(CN2CCC(CC2)(C(=O)NO)S(=O)(=O)c2ccc(Oc3ccc(Cl)cc3)cc2)cc1
: