Target
Interstitial collagenase
Ligand
BDBM50128634
Substrate
Meas. Tech.
ChEMBL_106291 (CHEMBL714547)
IC50
2640±n/a nM
Citation
 Aranapakam, VDavis, JMGrosu, GTBaker, JEllingboe, JZask, ALevin, JISandanayaka, VPDu, MSkotnicki, JSDiJoseph, JFSung, ASharr, MAKillar, LMWalter, TJin, GCowling, RTillett, JZhao, WMcDevitt, JXu, ZB Synthesis and structure-activity relationship of N-substituted 4-arylsulfonylpiperidine-4-hydroxamic acids as novel, orally active matrix metalloproteinase inhibitors for the treatment of osteoarthritis. J Med Chem 46:2376-96 (2003)  
Target
Name:
Interstitial collagenase
Synonyms:
CLG MMP1 Matrix metalloproteinase-1 | Matrix metalloproteinase-1 (MMP-1)
Type:
Enzyme
Mol. Mass.:
54010.26
Organism:
Homo sapiens (Human)
Description:
P03956
Residue:
469
  
Inhibitor
Name:
BDBM50128634
Synonyms:
1-Cyclooctyl-4-(4-methoxy-benzenesulfonyl)-piperidine-4-carboxylic acid hydroxyamide CHEMBL81763
Type:
Small organic molecule
Emp. Form.:
C21H32N2O5S
Mol. Mass.:
424.554
SMILES:
COc1ccc(cc1)S(=O)(=O)C1(CCN(CC1)C1CCCCCCC1)C(=O)NO
: