Target
Matrix metalloproteinase-9
Ligand
BDBM50128674
Substrate
Meas. Tech.
ChEMBL_105516 (CHEMBL715225)
IC50
2±n/a nM
Citation
 Aranapakam, VDavis, JMGrosu, GTBaker, JEllingboe, JZask, ALevin, JISandanayaka, VPDu, MSkotnicki, JSDiJoseph, JFSung, ASharr, MAKillar, LMWalter, TJin, GCowling, RTillett, JZhao, WMcDevitt, JXu, ZB Synthesis and structure-activity relationship of N-substituted 4-arylsulfonylpiperidine-4-hydroxamic acids as novel, orally active matrix metalloproteinase inhibitors for the treatment of osteoarthritis. J Med Chem 46:2376-96 (2003)  
Target
Name:
Matrix metalloproteinase-9
Synonyms:
67 kDa matrix metalloproteinase-9 92 kDa gelatinase CLG4B Gelatinase B MMP9 Matrix metalloproteinase 9 (MMP-9) Matrix metalloproteinase-9 (MMP9)
Type:
Enzyme
Mol. Mass.:
78452.28
Organism:
Homo sapiens (Human)
Description:
P14780
Residue:
707
  
Inhibitor
Name:
BDBM50128674
Synonyms:
4-(4-(4-chlorophenoxy)phenylsulfonyl)-N-hydroxy-1-methylpiperidine-4-carboxamide CHEMBL78337
Type:
Small organic molecule
Emp. Form.:
C19H21ClN2O5S
Mol. Mass.:
424.898
SMILES:
CN1CCC(CC1)(C(=O)NO)S(=O)(=O)c1ccc(Oc2ccc(Cl)cc2)cc1
: