Target
2-5A-dependent ribonuclease
Ligand
BDBM50370220
Substrate
Meas. Tech.
ChEMBL_195099 (CHEMBL800846)
IC50
2±n/a nM
Citation
 Sawai, HHirano, AMori, HShinozuka, KDong, BSilverman, RH Synthesis, characterization, and biological properties of 8-azido- and 8-amino-substituted 2',5'-oligoadenylates. J Med Chem 46:4926-32 (2003)  
Target
Name:
2-5A-dependent ribonuclease
Synonyms:
2-5A-dependent RNase RN5A_MOUSE Ribonuclease 4 Rnasel | Rns4
Type:
PROTEIN
Mol. Mass.:
83274.00
Organism:
Mus musculus
Description:
ChEMBL_195099
Residue:
735
  
Inhibitor
Name:
BDBM50370220
Synonyms:
CHEMBL1163094
Type:
Small organic molecule
Emp. Form.:
C30H35N24O19P3
Mol. Mass.:
1128.6696
SMILES:
Nc1ncnc2n(C3O[C@H](COP(O)(=O)OC4C(O)C(COP(O)(=O)OC5C(O)C(COP(O)(O)=O)OC5n5c(N=[N+]=[N-])nc6c(N)ncnc56)OC4n4c(N=[N+]=[N-])nc5c(N)ncnc45)[C@@H](O)[C@H]3O)c(N=[N+]=[N-])nc12
: