Target
5-hydroxytryptamine receptor 7
Ligand
BDBM50001884
Substrate
Meas. Tech.
ChEMBL_3749 (CHEMBL620750)
Ki
6.3±n/a nM
Citation
 Glennon, RA Higher-end serotonin receptors: 5-HT(5), 5-HT(6), and 5-HT(7). J Med Chem 46:2795-812 (2003)  
Target
Name:
5-hydroxytryptamine receptor 7
Synonyms:
5-HT-7 5-HT7 5-HT7S 5-hydroxytryptamine receptor 7 5HT7R_RAT GPRFO Serotonin (5-HT) receptor | Serotonin Receptor 7
Type:
G Protein-Coupled Receptor (GPCR)
Mol. Mass.:
49852.62
Organism:
Rattus norvegicus (rat)
Description:
Rat cloned 5-HT7R.
Residue:
448
  
Inhibitor
Name:
BDBM50001884
Synonyms:
2-[4-(4-Methyl-benzyl)-piperazin-1-yl]-1-(2-methyl-2,3-dihydro-indol-1-yl)-ethanone 3-chloro-6-(4-methyl-piperazin-1-yl)-5H-dibenzo[b,e][1,4]diazepine 8-Chloro-11-(4-methyl-piperazin-1-yl)-5H-dibenzo[b,e][1,4]diazepine( Clozepine ) 8-Chloro-11-(4-methyl-piperazin-1-yl)-5H-dibenzo[b,e][1,4]diazepine(Clopazine) 8-chloro-11-(4-methylpiperazin-1-yl)-5H-dibenzo[b,e][1,4]diazepine CHEMBL538973 CLOZAPINE, 8-CHLORO-11-(4-METHYL-PIPERAZIN-1-YL)-5H-DIBENZO[B,E][1,4]DIAZEPINE HF 1854 US10752588, Compound Clozapine | US11498896, Compound Clozapine
Type:
Small organic molecule
Emp. Form.:
C18H19ClN4
Mol. Mass.:
326.823
SMILES:
CN1CCN(CC1)C1=Nc2cc(Cl)ccc2Nc2ccccc12
: