Target
NH(3)-dependent NAD(+) synthetase
Ligand
BDBM50130807
Substrate
Meas. Tech.
ChEMBL_141613 (CHEMBL747929)
IC50
>1000000±n/a nM
Citation
 Velu, SECristofoli, WAGarcia, GJBrouillette, CGPierson, MCLuan, CHDeLucas, LJBrouillette, WJ Tethered dimers as NAD synthetase inhibitors with antibacterial activity. J Med Chem 46:3371-81 (2003)  
Target
Name:
NH(3)-dependent NAD(+) synthetase
Synonyms:
GSP38 NADE_BACSU Sporulation protein outB outB
Type:
PROTEIN
Mol. Mass.:
30386.77
Organism:
Bacillus subtilis
Description:
ChEMBL_141613
Residue:
272
  
Inhibitor
Name:
BDBM50130807
Synonyms:
CHEMBL325274 | Nicotinic acid 3-(5-nitro-indol-1-yl)-propyl ester
Type:
Small organic molecule
Emp. Form.:
C17H15N3O4
Mol. Mass.:
325.3187
SMILES:
[O-][N+](=O)c1ccc2n(CCCOC(=O)c3cccnc3)ccc2c1
: