Target
NH(3)-dependent NAD(+) synthetase
Ligand
BDBM50370232
Substrate
Meas. Tech.
ChEMBL_141613 (CHEMBL747929)
IC50
>1000±n/a nM
Citation
 Velu, SECristofoli, WAGarcia, GJBrouillette, CGPierson, MCLuan, CHDeLucas, LJBrouillette, WJ Tethered dimers as NAD synthetase inhibitors with antibacterial activity. J Med Chem 46:3371-81 (2003)  
Target
Name:
NH(3)-dependent NAD(+) synthetase
Synonyms:
GSP38 NADE_BACSU Sporulation protein outB outB
Type:
PROTEIN
Mol. Mass.:
30386.77
Organism:
Bacillus subtilis
Description:
ChEMBL_141613
Residue:
272
  
Inhibitor
Name:
BDBM50370232
Synonyms:
BA-41166E RIFAMPIN Rifampicin
Type:
Small organic molecule
Emp. Form.:
C43H58N4O12
Mol. Mass.:
822.9402
SMILES:
CO[C@H]1\C=C\O[C@@]2(C)Oc3c(C2=O)c2c(O)c(\C=N\N4CCN(C)CC4)c(NC(=O)\C(C)=C/C=C/[C@H](C)[C@H](O)[C@@H](C)[C@@H](O)[C@@H](C)[C@H](OC(C)=O)[C@@H]1C)c(O)c2c(O)c3C
: