Target
Major prion protein
Ligand
BDBM50010859
Substrate
Meas. Tech.
ChEMBL_158887 (CHEMBL760875)
EC50
10000±n/a nM
Citation
 Vogtherr, MGrimme, SElshorst, BJacobs, DMFiebig, KGriesinger, CZahn, R Antimalarial drug quinacrine binds to C-terminal helix of cellular prion protein. J Med Chem 46:3563-4 (2003)  
Target
Name:
Major prion protein
Synonyms:
ALTPRP CD_antigen=CD230 PRIP PRP PrP33-35C major prion protein preproprotein
Type:
PROTEIN
Mol. Mass.:
27671.97
Organism:
Homo sapiens (Human)
Description:
ChEMBL_158887
Residue:
253
  
Inhibitor
Name:
BDBM50010859
Synonyms:
CHEMBL11 IMIPRAMINE PAMOATE | Imipramin
Type:
Small organic molecule
Emp. Form.:
C19H24N2
Mol. Mass.:
280.4073
SMILES:
CN(C)CCCN1c2ccccc2CCc2ccccc12
: