Target
Prothrombin
Ligand
BDBM50131792
Substrate
Meas. Tech.
ChEMBL_208359 (CHEMBL813669)
Ki
0.017±n/a nM
Citation
 Lee, KPark, CWJung, WHPark, HDLee, SHChung, KHPark, SKKwon, OHKang, MPark, DHLee, SKKim, EEYoon, SKKim, A Efficacious and orally bioavailable thrombin inhibitors based on a 2,5-thienylamidine at the P1 position: discovery of N-carboxymethyl-d-diphenylalanyl-l-prolyl[(5-amidino-2-thienyl)methyl]amide. J Med Chem 46:3612-22 (2003)  
Target
Name:
Prothrombin
Synonyms:
Activation peptide fragment 1 Coagulation factor II Prothrombin precursor Thrombin heavy chain | Thrombin light chain
Type:
Protein
Mol. Mass.:
70029.57
Organism:
Homo sapiens (Human)
Description:
P00734
Residue:
622
  
Inhibitor
Name:
BDBM50131792
Synonyms:
(1-Benzhydryl-2-{2-[(6-carbamimidoyl-pyridin-3-ylmethyl)-carbamoyl]-pyrrolidin-1-yl}-2-oxo-ethyl)-carbamic acid methyl ester | CHEMBL331571
Type:
Small organic molecule
Emp. Form.:
C29H32N6O4
Mol. Mass.:
528.6022
SMILES:
COC(=O)N[C@H](C(c1ccccc1)c1ccccc1)C(=O)N1CCC[C@H]1C(=O)NCc1ccc(nc1)C(N)=N
: