Target
Melanocortin receptor 4
Ligand
BDBM50001520
Substrate
Meas. Tech.
ChEMBL_106347 (CHEMBL713802)
IC50
3.4±n/a nM
Citation
 Balse-Srinivasan, PGrieco, PCai, MTrivedi, DHruby, VJ Structure-activity relationships of novel cyclic alpha-MSH/beta-MSH hybrid analogues that lead to potent and selective ligands for the human MC3R and human MC5R. J Med Chem 46:3728-33 (2003)  
Target
Name:
Melanocortin receptor 4
Synonyms:
MC4-R MC4R_HUMAN Melanocortin receptor 4 (MC-4) Melanocortin receptor 4 (MC4R)
Type:
Enzyme
Mol. Mass.:
36949.50
Organism:
Homo sapiens (Human)
Description:
P32245
Residue:
332
  
Inhibitor
Name:
BDBM50001520
Synonyms:
CHEMBL2111807
Type:
Small organic molecule
Emp. Form.:
C72H96N18O16S2
Mol. Mass.:
1533.774
SMILES:
CC(=O)[C@@H]1CSSC[C@H](NC(=O)[C@@H](Cc2c[nH]c3ccccc23)NC(=O)[C@H](CCCN=C(N)N)NC(=O)[C@H](Cc2ccc3ccccc3c2)NC(=O)[C@H](Cc2c[nH]cn2)NC(=O)[C@@H](CCC(O)=O)NC1=O)C(=O)N1CCC[C@H]1C(=O)CN1CCC[C@H]1C(=O)CN[C@@H](CCCCN)C(=O)CN[C@@H](CC(O)=O)C(N)=O
: