Target
Alpha-1A adrenergic receptor
Ligand
BDBM50131926
Substrate
Meas. Tech.
ChEMBL_33275 (CHEMBL643613)
Ki
5.8±n/a nM
Citation
 Campiani, GButini, STrotta, FFattorusso, CCatalanotti, BAiello, FGemma, SNacci, VNovellino, EStark, JACagnotto, AFumagalli, ECarnovali, FCervo, LMennini, T Synthesis and pharmacological evaluation of potent and highly selective D3 receptor ligands: inhibition of cocaine-seeking behavior and the role of dopamine D3/D2 receptors. J Med Chem 46:3822-39 (2003)  
Target
Name:
Alpha-1A adrenergic receptor
Synonyms:
ADA1A_RAT Adra1c Alpha-1A adrenoceptor Alpha-1C adrenergic receptor | adrenergic Alpha1A
Type:
Protein
Mol. Mass.:
51620.15
Organism:
Rattus norvegicus (Rat)
Description:
P43140
Residue:
466
  
Inhibitor
Name:
BDBM50131926
Synonyms:
CHEMBL127400 Isoquinoline-3-carboxylic acid {4-[4-(2-methoxy-phenyl)-piperazin-1-yl]-butyl}-amide
Type:
Small organic molecule
Emp. Form.:
C25H30N4O2
Mol. Mass.:
418.5313
SMILES:
COc1ccccc1N1CCN(CCCCNC(=O)c2cc3ccccc3cn2)CC1
: