Target
Tryptase beta-2
Ligand
BDBM50131974
Substrate
Meas. Tech.
ChEMBL_210835 (CHEMBL811864)
Ki
180±n/a nM
Citation
 Costanzo, MJYabut, SCAlmond, HRAndrade-Gordon, PCorcoran, TWDe Garavilla, LKauffman, JAAbraham, WMRecacha, RChattopadhyay, DMaryanoff, BE Potent, small-molecule inhibitors of human mast cell tryptase. Antiasthmatic action of a dipeptide-based transition-state analogue containing a benzothiazole ketone. J Med Chem 46:3865-76 (2003)  
Target
Name:
Tryptase beta-2
Synonyms:
TPS2 TRYB2_HUMAN Tryptase II Tryptase-2
Type:
PROTEIN
Mol. Mass.:
30518.79
Organism:
Homo sapiens (Human)
Description:
ChEMBL_210702
Residue:
275
  
Inhibitor
Name:
BDBM50131974
Synonyms:
1-Acetyl-4-hydroxy-pyrrolidine-2-carboxylic acid [4-guanidino-1-(thiazole-2-carbonyl)-butyl]-amide; TFA | CHEMBL341083
Type:
Small organic molecule
Emp. Form.:
C16H24N6O4S
Mol. Mass.:
396.465
SMILES:
CC(=O)N1C[C@H](O)C[C@H]1C(=O)NC(CCCNC(N)=N)C(=O)c1nccs1
: