Target
Sortilin
Ligand
BDBM50240845
Substrate
Meas. Tech.
ChEMBL_144311 (CHEMBL754356)
IC50
640±n/a nM
Citation
 Kokko, KPHadden, MKOrwig, KSMazella, JDix, TA In vitro analysis of stable, receptor-selective neurotensin[8-13] analogues. J Med Chem 46:4141-8 (2003)  
Target
Name:
Sortilin
Synonyms:
Neurotensin receptor 3 SORT_HUMAN
Type:
PROTEIN
Mol. Mass.:
92054.53
Organism:
Homo sapiens (Human)
Description:
ChEMBL_1282402
Residue:
831
  
Inhibitor
Name:
BDBM50240845
Synonyms:
(S)-2-{(2S,3R)-2-[(S)-2-({(S)-1-[(S)-2-((S)-2-Amino-5-guanidino-pentanoylamino)-5-guanidino-pentanoyl]-pyrrolidine-2-carbonyl}-amino)-3-(4-hydroxy-phenyl)-propionylamino]-3-methyl-pentanoylamino}-4-methyl-pentanoic acid CHEMBL342252 | Neurotensin(8-13)
Type:
Small organic molecule
Emp. Form.:
C38H64N12O8
Mol. Mass.:
816.9904
SMILES:
[#6]-[#6]-[#6@@H](-[#6])-[#6@H](-[#7]-[#6](=O)-[#6@H](-[#6]-c1ccc(-[#8])cc1)-[#7]-[#6](=O)-[#6@@H]-1-[#6]-[#6]-[#6]-[#7]-1-[#6](=O)-[#6@H](-[#6]-[#6]-[#6]\[#7]=[#6](\[#7])-[#7])-[#7]-[#6](=O)-[#6@@H](-[#7])-[#6]-[#6]-[#6]\[#7]=[#6](\[#7])-[#7])-[#6](=O)-[#7]-[#6@@H](-[#6]-[#6](-[#6])-[#6])-[#6](-[#8])=O
: