Target
Delta-type opioid receptor
Ligand
BDBM50133227
Substrate
Meas. Tech.
ChEMBL_146916 (CHEMBL757504)
Ki
13.3±n/a nM
Citation
 Schütz, JSpetea, MKoch, MAceto, MDHarris, LSCoop, ASchmidhammer, H Synthesis and biological evaluation of 14-alkoxymorphinans. 20. 14-phenylpropoxymetopon: an extremely powerful analgesic. J Med Chem 46:4182-7 (2003)  
Target
Name:
Delta-type opioid receptor
Synonyms:
Cytochrome P450 3A4 Delta opioid receptor Delta-type opioid receptor (DOR) OPRD_RAT Opioid receptor Opioid receptors; mu & delta Ror-a | Voltage-gated potassium channel
Type:
G Protein-Coupled Receptor (GPCR)
Mol. Mass.:
40465.04
Organism:
Rattus norvegicus (rat)
Description:
Competition binding assays were using CHO-K1 cell membranes expressing the opioid receptor.
Residue:
372
  
Inhibitor
Name:
BDBM50133227
Synonyms:
10,17-dimethoxy-4,13-dimethyl-12-oxa-4-azapentacyclo[9.6.1.01,13.05,17.07,18]octadeca-7(18),8,10-trien-14-one | CHEMBL133454
Type:
Small organic molecule
Emp. Form.:
C21H29NO4
Mol. Mass.:
359.4593
SMILES:
CCC[C@]12c3c4O[C@@]1(C)C(=O)CC[C@@]2(OC)C(Cc3ccc4OC)NC
: