Target
Melanocyte-stimulating hormone receptor
Ligand
BDBM50121268
Substrate
Meas. Tech.
ChEMBL_105824 (CHEMBL716484)
EC50
0.036000±n/a nM
Citation
 Hruby, VJ Peptide science: exploring the use of chemical principles and interdisciplinary collaboration for understanding life processes. J Med Chem 46:4215-31 (2003)  
Target
Name:
Melanocyte-stimulating hormone receptor
Synonyms:
MC1-R MSH-R MSHR_HUMAN Melanocortin receptor (M1 and M4) Melanocortin receptor 1 (MC1-R) | Melanocortin receptor 1 (MC1R)
Type:
Enzyme
Mol. Mass.:
34717.23
Organism:
Homo sapiens (Human)
Description:
Q01726
Residue:
317
  
Inhibitor
Name:
BDBM50121268
Synonyms:
21-(2-Acetylamino-hexanoylamino)-7-[3-(diaminomethaniminium)-propyl]-10-(1H-indol-3-ylmethyl)-4-naphthalen-2-ylmethyl-2,5,8,11,19,22-hexaoxo-3,6,9,12,18,23-hexaaza-tricyclo[21.7.0.0*24,29*]triaconta-24(29),25,27 CID44366078 | SHU-9119
Type:
Small organic molecule
Emp. Form.:
C54H71N15O9
Mol. Mass.:
1074.2366
SMILES:
CCCC[C@@H](NC(C)=O)C(=O)N[C@@H]1CC(=O)NCCCC[C@H](NC(=O)[C@H](Cc2c[nH]c3ccccc23)NC(=O)[C@H](CCCNC(N)=N)NC(=O)[C@@H](Cc2ccc3ccccc3c2)NC(=O)[C@H](Cc2c[nH]cn2)NC1=O)C(N)=O
: