Target
Chymotrypsinogen A
Ligand
BDBM31770
Substrate
Meas. Tech.
ChEMBL_49921 (CHEMBL664290)
IC50
110000±n/a nM
Citation
 Seidler, JMcGovern, SLDoman, TNShoichet, BK Identification and prediction of promiscuous aggregating inhibitors among known drugs. J Med Chem 46:4477-86 (2003)  
Target
Name:
Chymotrypsinogen A
Synonyms:
Alpha-chymotrypsin Chymotrypsin A Chymotrypsin A chain B Chymotrypsinogen A | alpha-Chymotrypsin (α-Chymotrypsin)
Type:
Serine protease
Mol. Mass.:
25670.88
Organism:
Bos taurus (bovine)
Description:
Residue:
245
  
Inhibitor
Name:
BDBM31770
Synonyms:
Exelderm cid_65495 | sulconazole
Type:
Small organic molecule
Emp. Form.:
C18H15Cl3N2S
Mol. Mass.:
397.749
SMILES:
Clc1ccc(CSC(Cn2ccnc2)c2ccc(Cl)cc2Cl)cc1
: