Target
cGMP-specific 3',5'-cyclic phosphodiesterase
Ligand
BDBM50134115
Substrate
Meas. Tech.
ChEMBL_155183 (CHEMBL761830)
IC50
50±n/a nM
Citation
 Daugan, AGrondin, PRuault, CLe Monnier de Gouville, ACCoste, HKirilovsky, JHyafil, FLabaudinière, R The discovery of tadalafil: a novel and highly selective PDE5 inhibitor. 1: 5,6,11,11a-tetrahydro-1H-imidazo[1',5':1,6]pyrido[3,4-b]indole-1,3(2H)-dione analogues. J Med Chem 46:4525-32 (2003)  
Target
Name:
cGMP-specific 3',5'-cyclic phosphodiesterase
Synonyms:
PDE5 PDE5A_BOVIN | Phosphodiesterase 5A
Type:
PROTEIN
Mol. Mass.:
98615.45
Organism:
Bos taurus
Description:
ChEMBL_155186
Residue:
865
  
Inhibitor
Name:
BDBM50134115
Synonyms:
(3aR,10S)-2-Butyl-10-(3-chloro-phenyl)-3a,4,9,10-tetrahydro-2,9,10a-triaza-cyclopenta[b]fluorene-1,3-dione Trans-2-Butyl-10-(3-chloro-phenyl)-3a,4,9,10-tetrahydro-2,9,10a-triaza-cyclopenta[b]fluorene-1,3-dione
Type:
Small organic molecule
Emp. Form.:
C23H22ClN3O2
Mol. Mass.:
407.893
SMILES:
CCCCn1c(O)c2Cc3c([nH]c4ccccc34)[C@H](c3cccc(Cl)c3)n2c1=O
: