Target
Nuclear receptor subfamily 1 group I member 3
Ligand
BDBM8885
Substrate
Meas. Tech.
ChEMBL_48049 (CHEMBL666774)
IC50
30000±n/a nM
Citation
 Jyrkkärinne, JMäkinen, JGynther, JSavolainen, HPoso, AHonkakoski, P Molecular determinants of steroid inhibition for the mouse constitutive androstane receptor. J Med Chem 46:4687-95 (2003)  
Target
Name:
Nuclear receptor subfamily 1 group I member 3
Synonyms:
Car NR1I3_MOUSE Nuclear receptor subfamily 1 group I member 3 | Orphan nuclear receptor MB67
Type:
PROTEIN
Mol. Mass.:
40922.30
Organism:
Mus musculus
Description:
ChEMBL_48051
Residue:
358
  
Inhibitor
Name:
BDBM8885
Synonyms:
(1S,2R,10R,11S,14S,15S)-14-hydroxy-2,15-dimethyltetracyclo[8.7.0.0^{2,7}.0^{11,15}]heptadec-6-en-5-one Testosterone US9682960, Testosterone
Type:
Steroid
Emp. Form.:
C19H28O2
Mol. Mass.:
288.4244
SMILES:
[H][C@@]12CC[C@H](O)[C@@]1(C)CC[C@@]1([H])[C@@]2([H])CCC2=CC(=O)CC[C@]12C
: