Target
Reverse transcriptase/RNaseH
Ligand
BDBM50164644
Substrate
Meas. Tech.
ChEMBL_196192 (CHEMBL803637)
Ki
510±n/a nM
Citation
 Wang, RHarada, SMitsuya, HZemlicka, J Inhibition of human immunodeficiency virus reverse transcriptase by synadenol triphosphate and its E-isomer. J Med Chem 46:4799-802 (2003)  
Target
Name:
Reverse transcriptase/RNaseH
Synonyms:
HIV-1 Reverse Transcriptase RNase H Reverse transcriptase/RNaseH
Type:
PROTEIN
Mol. Mass.:
65229.15
Organism:
Human immunodeficiency virus 1
Description:
ChEMBL_1473730
Residue:
566
  
Inhibitor
Name:
BDBM50164644
Synonyms:
2',3'-Dideoxyadenosine Triphosphate (Ddatp) ATP,2',3'-dideoxy [[[5-(6-amino-9H-purin-9-yl)tetrahydrofuran-2-yl]methoxy-hydroxy-phosphoryl]oxy-hydroxy-phosphoryl]oxyphosphonic acid ddATP
Type:
Small organic molecule
Emp. Form.:
C10H16N5O11P3
Mol. Mass.:
475.1822
SMILES:
Nc1ncnc2n(cnc12)[C@H]1CC[C@@H](COP(O)(=O)OP(O)(=O)OP(O)(O)=O)O1
: